Target
Vascular endothelial growth factor receptor 2
Ligand
BDBM50020246
Substrate
Meas. Tech.
ChEMBL_1364555 (CHEMBL3295610)
IC50
20±n/a nM
Citation
 Lv, YLi, MLiu, TTong, LPeng, TWei, LDing, JXie, HDuan, W Discovery of a New Series of Naphthamides as Potent VEGFR-2 Kinase Inhibitors. ACS Med Chem Lett 5:592-7 (2014)  
Target
Name:
Vascular endothelial growth factor receptor 2
Synonyms:
CD_antigen=CD309 Fetal liver kinase 1 (FLK-1) KDR Protein-tyrosine kinase receptor Flk-1 VEGFR-2 VEGFR2 Vascular Endothelial Growth Factor Receptor Kinase 2 Vascular endothelial growth factor receptor 2 (KDR) Vascular endothelial growth factor receptor 2 (VEGFR2) Vascular endothelial growth factor receptor-2 (VEGFR-2)
Type:
Receptor Tyrosine Kinase
Mol. Mass.:
151510.97
Organism:
Homo sapiens (Human)
Description:
P35968
Residue:
1356
  
Inhibitor
Name:
BDBM50020246
Synonyms:
CHEMBL3288521 | US9914707, I-25
Type:
Small organic molecule
Emp. Form.:
C23H17N5O
Mol. Mass.:
379.414
SMILES:
Nc1n[nH]c2cccc(-c3ccc4c(cccc4c3)C(=O)Nc3cccnc3)c12
: