Target
Fibroblast growth factor receptor 1
Ligand
BDBM50020310
Substrate
Meas. Tech.
ChEMBL_1365412 (CHEMBL3296771)
Ki
350±n/a nM
Citation
 Zhang, LZheng, QYang, YZhou, HGong, XZhao, SFan, C Synthesis and in vivo SAR study of indolin-2-one-based multi-targeted inhibitors as potential anticancer agents. Eur J Med Chem 82:139-51 (2014)  
Target
Name:
Fibroblast growth factor receptor 1
Synonyms:
BFGFR Basic fibroblast growth factor receptor 1 (FGFR1) CEK FGFR-1 FGFR-1, (FL) FGFR1_HUMAN FLT2 Fibroblast growth factor receptor 1 (FGFR-1) Fms-like tyrosine kinase 2 N-sam bFGF-R | c-fgr
Type:
Receptor
Mol. Mass.:
91861.70
Organism:
Homo sapiens (Human)
Description:
P11362
Residue:
822
  
Inhibitor
Name:
BDBM50020310
Synonyms:
CHEMBL3288854
Type:
Small organic molecule
Emp. Form.:
C23H28FN5O2
Mol. Mass.:
425.4991
SMILES:
CN1CCN(CCC(=O)Nc2c(C)[nH]c(\C=C3/C(=O)Nc4ccc(F)cc34)c2C)CC1
: