Target
Polyunsaturated fatty acid lipoxygenase ALOX15
Ligand
BDBM50020589
Substrate
Meas. Tech.
ChEMBL_1361591 (CHEMBL3295414)
IC50
13±n/a nM
Citation
 Koeberle, AMuņoz, EAppendino, GBMinassi, APace, SRossi, AWeinigel, CBarz, DSautebin, LCaprioglio, DCollado, JAWerz, O SAR studies on curcumin's pro-inflammatory targets: discovery of prenylated pyrazolocurcuminoids as potent and selective novel inhibitors of 5-lipoxygenase. J Med Chem 57:5638-48 (2014)  
Target
Name:
Polyunsaturated fatty acid lipoxygenase ALOX15
Synonyms:
15-Lipoxygenase-1 (15-LOX-1) Arachidonate 15-lipoxygenase LOG15 Reticulocyte 15-lipoxygenase-1 | Sphingosine 1-phosphate receptor 1 (S1P1)
Type:
Protein
Mol. Mass.:
74804.05
Organism:
Homo sapiens (Human)
Description:
Residue:
662
  
Inhibitor
Name:
BDBM50020589
Synonyms:
CHEMBL3290441
Type:
Small organic molecule
Emp. Form.:
C31H36N2O4
Mol. Mass.:
500.6285
SMILES:
COc1cc(\C=C\c2cc(\C=C\c3cc(CC=C(C)C)c(O)c(OC)c3)[nH]n2)cc(CC=C(C)C)c1O
: