Target
Dihydroorotate dehydrogenase (quinone), mitochondrial
Ligand
BDBM50020694
Substrate
Meas. Tech.
ChEMBL_1362299 (CHEMBL3291895)
IC50
2280±n/a nM
Citation
 Vyas, VKVariya, BGhate, MD Design, synthesis and pharmacological evaluation of novel substituted quinoline-2-carboxamide derivatives as human dihydroorotate dehydrogenase (hDHODH) inhibitors and anticancer agents. Eur J Med Chem 82:385-93 (2014)  
Target
Name:
Dihydroorotate dehydrogenase (quinone), mitochondrial
Synonyms:
DHODH Dihydroorotate dehydrogenase Dihydroorotate dehydrogenase, mitochondrial Dihydroorotate oxidase (DHODH) | PYRD_HUMAN
Type:
Enzyme
Mol. Mass.:
42881.33
Organism:
Homo sapiens (Human)
Description:
Q02127
Residue:
395
  
Inhibitor
Name:
BDBM50020694
Synonyms:
CHEMBL3286441
Type:
Small organic molecule
Emp. Form.:
C24H20N2O3
Mol. Mass.:
384.4272
SMILES:
COc1ccc2nc(C(=O)Nc3ccc(cc3)-c3ccccc3)c(C)c(O)c2c1
: