Target
E3 ubiquitin-protein ligase Mdm2
Ligand
BDBM50020724
Substrate
Meas. Tech.
ChEMBL_1363438 (CHEMBL3295827)
IC50
550±n/a nM
Citation
 Gomha, SMEldebss, TMAbdulla, MMMayhoub, AS Diphenylpyrroles: Novel p53 activators. Eur J Med Chem 82:472-9 (2014)  
Target
Name:
E3 ubiquitin-protein ligase Mdm2
Synonyms:
Double minute 2 protein E3 ubiquitin-protein ligase Mdm2 (p53-binding protein Mdm2) Human Double Minute 2 (HDM2) MDM2-MDMX p53-Binding Protein MDM2 | p53-binding protein
Type:
Oncoprotein
Mol. Mass.:
55196.54
Organism:
Homo sapiens (Human)
Description:
Q00987
Residue:
491
  
Inhibitor
Name:
BDBM50020724
Synonyms:
CHEMBL3291438
Type:
Small organic molecule
Emp. Form.:
C25H22N2O3
Mol. Mass.:
398.4538
SMILES:
CCOC(=O)c1ccc([nH]c1=O)-c1c(C)[nH]c(c1-c1ccccc1)-c1ccccc1
: