Target
Histone deacetylase 3
Ligand
BDBM50020897
Substrate
Meas. Tech.
ChEMBL_1364647 (CHEMBL3291780)
IC50
260±n/a nM
Citation
 Chen, FChai, HSu, MBZhang, YMLi, JXie, XNan, FJ Potent and orally efficacious bisthiazole-based histone deacetylase inhibitors. ACS Med Chem Lett 5:628-33 (2014)  
Target
Name:
Histone deacetylase 3
Synonyms:
HD3 HDAC3_HUMAN Human HDAC3 SMAP45
Type:
Enzyme
Mol. Mass.:
48829.55
Organism:
Homo sapiens (Human)
Description:
O15379
Residue:
428
  
Inhibitor
Name:
BDBM50020897
Synonyms:
CHEMBL3287255 | US9216962, CFH367-C
Type:
Small organic molecule
Emp. Form.:
C15H18N4O3S2
Mol. Mass.:
366.458
SMILES:
ONC(=O)CCCCNC(=O)c1nc(sc1C1CC1)-c1nccs1
: