Target
Histone deacetylase 3
Ligand
BDBM50020905
Substrate
Meas. Tech.
ChEMBL_1364647 (CHEMBL3291780)
IC50
160±n/a nM
Citation
 Chen, FChai, HSu, MBZhang, YMLi, JXie, XNan, FJ Potent and orally efficacious bisthiazole-based histone deacetylase inhibitors. ACS Med Chem Lett 5:628-33 (2014)  
Target
Name:
Histone deacetylase 3
Synonyms:
HD3 HDAC3_HUMAN Human HDAC3 SMAP45
Type:
Enzyme
Mol. Mass.:
48829.55
Organism:
Homo sapiens (Human)
Description:
O15379
Residue:
428
  
Inhibitor
Name:
BDBM50020905
Synonyms:
CHEMBL3287263 | US9216962, CFH461
Type:
Small organic molecule
Emp. Form.:
C21H24N4O4S2
Mol. Mass.:
460.57
SMILES:
ONC(=O)CCCCNC(=O)c1nc(sc1CCOCc1ccccc1)-c1nccs1
: