Target
Apoptosis regulator Bcl-2
Ligand
BDBM50020938
Substrate
Meas. Tech.
ChEMBL_1365048 (CHEMBL3291804)
Kd
4400±n/a nM
Citation
 Koehler, MFBergeron, PChoo, EFLau, KNdubaku, CDudley, DGibbons, PSleebs, BERye, CSNikolakopoulos, GBui, CKulasegaram, SKersten, WJSmith, BJCzabotar, PEColman, PMHuang, DCBaell, JBWatson, KGHasvold, LTao, ZFWang, LSouers, AJElmore, SWFlygare, JAFairbrother, WJLessene, G Structure-Guided Rescaffolding of Selective Antagonists of BCL-XL. ACS Med Chem Lett 5:662-7 (2014)  
Target
Name:
Apoptosis regulator Bcl-2
Synonyms:
Apoptosis regulator Bcl-2 Protein BCL-2 BCL2_HUMAN | Bcl-2 Protein
Type:
Homodimer or heterodimer
Mol. Mass.:
26269.11
Organism:
Homo sapiens (Human)
Description:
P10415
Residue:
239
  
Inhibitor
Name:
BDBM50020938
Synonyms:
CHEMBL3287301
Type:
Small organic molecule
Emp. Form.:
C30H26N4O4S2
Mol. Mass.:
570.682
SMILES:
OC(=O)c1nc(sc1CCCOc1ccccc1)N1CCc2cccc(C(=O)Nc3nc4ccccc4s3)c2C1
: