Target
Vascular endothelial growth factor receptor 2
Ligand
BDBM50020953
Substrate
Meas. Tech.
ChEMBL_1365056 (CHEMBL3291812)
IC50
9.8±n/a nM
Citation
 Zhan, ZAi, JLiu, QJi, YChen, TXu, YGeng, MDuan, W Discovery of Anilinopyrimidines as Dual Inhibitors of c-Met and VEGFR-2: Synthesis, SAR, and Cellular Activity. ACS Med Chem Lett 5:673-8 (2014)  
Target
Name:
Vascular endothelial growth factor receptor 2
Synonyms:
CD_antigen=CD309 Fetal liver kinase 1 (FLK-1) KDR Protein-tyrosine kinase receptor Flk-1 VEGFR-2 VEGFR2 Vascular Endothelial Growth Factor Receptor Kinase 2 Vascular endothelial growth factor receptor 2 (KDR) Vascular endothelial growth factor receptor 2 (VEGFR2) Vascular endothelial growth factor receptor-2 (VEGFR-2)
Type:
Receptor Tyrosine Kinase
Mol. Mass.:
151510.97
Organism:
Homo sapiens (Human)
Description:
P35968
Residue:
1356
  
Inhibitor
Name:
BDBM50020953
Synonyms:
CHEMBL3287317
Type:
Small organic molecule
Emp. Form.:
C29H25ClFN5O5S
Mol. Mass.:
610.056
SMILES:
CS(=O)(=O)Cc1cccc(Nc2nccc(Oc3ccc(NC(=O)C4(CC4)C(=O)Nc4cccc(Cl)c4)cc3F)n2)c1
: