Target
Hepatocyte growth factor receptor
Ligand
BDBM50021051
Substrate
Meas. Tech.
ChEMBL_1365058 (CHEMBL3292047)
IC50
806±n/a nM
Citation
 Zhan, ZAi, JLiu, QJi, YChen, TXu, YGeng, MDuan, W Discovery of Anilinopyrimidines as Dual Inhibitors of c-Met and VEGFR-2: Synthesis, SAR, and Cellular Activity. ACS Med Chem Lett 5:673-8 (2014)  
Target
Name:
Hepatocyte growth factor receptor
Synonyms:
Hepatocyte growth factor receptor Hepatocyte growth factor receptor (c-MET) MET Met proto-oncogene (hepatocyte growth factor receptor) Tyrosine-protein kinase Met (c-Met) c-Met kinase
Type:
Protein
Mol. Mass.:
155559.73
Organism:
Homo sapiens (Human)
Description:
P08581
Residue:
1390
  
Inhibitor
Name:
BDBM50021051
Synonyms:
CHEMBL3287604
Type:
Small organic molecule
Emp. Form.:
C31H25F2N5O5S
Mol. Mass.:
617.623
SMILES:
CS(=O)(=O)Cc1cccc(Nc2cc(Oc3ccc(NC(=O)C4(CC4)C(=O)Nc4ccc(F)cc4)cc3F)cc(n2)C#N)c1
: