Target
cAMP and cAMP-inhibited cGMP 3',5'-cyclic phosphodiesterase 10A
Ligand
BDBM50021194
Substrate
Meas. Tech.
ChEMBL_1366276 (CHEMBL3297609)
IC50
22±n/a nM
Citation
 Hu, EAndrews, KChmait, SZhao, XDavis, CMiller, SHill Della Puppa, GDovlatyan, MChen, HLester-Zeiner, DAble, JBiorn, CMa, JShi, JTreanor, JAllen, JR Discovery of Novel Imidazo[4,5-b]pyridines as Potent and Selective Inhibitors of Phosphodiesterase 10A (PDE10A). ACS Med Chem Lett 5:700-5 (2014)  
Target
Name:
cAMP and cAMP-inhibited cGMP 3',5'-cyclic phosphodiesterase 10A
Synonyms:
3',5'-cyclic phosphodiesterase PDE10_HUMAN Phosphodiesterase 10A
Type:
Protein
Mol. Mass.:
88412.52
Organism:
Homo sapiens (Human)
Description:
Q9Y233
Residue:
779
  
Inhibitor
Name:
BDBM50021194
Synonyms:
CHEMBL3287900
Type:
Small organic molecule
Emp. Form.:
C21H17N5S
Mol. Mass.:
371.458
SMILES:
CCc1nc2cccnc2n1-c1ccc(Nc2nc3ccccc3s2)cc1
: