Target
cAMP and cAMP-inhibited cGMP 3',5'-cyclic phosphodiesterase 10A
Ligand
BDBM50021252
Substrate
Meas. Tech.
ChEMBL_1366276 (CHEMBL3297609)
IC50
271±n/a nM
Citation
 Hu, EAndrews, KChmait, SZhao, XDavis, CMiller, SHill Della Puppa, GDovlatyan, MChen, HLester-Zeiner, DAble, JBiorn, CMa, JShi, JTreanor, JAllen, JR Discovery of Novel Imidazo[4,5-b]pyridines as Potent and Selective Inhibitors of Phosphodiesterase 10A (PDE10A). ACS Med Chem Lett 5:700-5 (2014)  
Target
Name:
cAMP and cAMP-inhibited cGMP 3',5'-cyclic phosphodiesterase 10A
Synonyms:
3',5'-cyclic phosphodiesterase PDE10_HUMAN Phosphodiesterase 10A
Type:
Protein
Mol. Mass.:
88412.52
Organism:
Homo sapiens (Human)
Description:
Q9Y233
Residue:
779
  
Inhibitor
Name:
BDBM50021252
Synonyms:
CHEMBL3287904
Type:
Small organic molecule
Emp. Form.:
C20H21N5OS
Mol. Mass.:
379.479
SMILES:
COc1nc2cccnc2n1C1CCC(CC1)Nc1nc2ccccc2s1
: