Target
Chymotrypsinogen A
Ligand
BDBM50021352
Substrate
Meas. Tech.
ChEMBL_1366692 (CHEMBL3296843)
Ki
290±n/a nM
Citation
 Troiano, VScarbaci, KEttari, RMicale, NCerchia, CPinto, ASchirmeister, TNovellino, EGrasso, SLavecchia, AZappalą, M Optimization of peptidomimetic boronates bearing a P3 bicyclic scaffold as proteasome inhibitors. Eur J Med Chem 83:1-14 (2014)  
Target
Name:
Chymotrypsinogen A
Synonyms:
Alpha-chymotrypsin Chymotrypsin A Chymotrypsin A chain B Chymotrypsinogen A | alpha-Chymotrypsin (α-Chymotrypsin)
Type:
Serine protease
Mol. Mass.:
25670.88
Organism:
Bos taurus (bovine)
Description:
Residue:
245
  
Inhibitor
Name:
BDBM50021352
Synonyms:
CHEMBL3287943
Type:
Small organic molecule
Emp. Form.:
C16H20BBrN2O4
Mol. Mass.:
395.056
SMILES:
CC(C)C[C@H](NC(=O)Cn1ccc2ccc(Br)cc2c1=O)B(O)O
: