Target
UDP-N-acetylmuramoylalanine--D-glutamate ligase
Ligand
BDBM50021359
Substrate
Meas. Tech.
ChEMBL_1361608 (CHEMBL3295431)
Kd
98000±n/a nM
Citation
 Simcic, MPureber, KKristan, KUrleb, UKocjan, DGrdadolnik, SG A novel 2-oxoindolinylidene inhibitor of bacterial MurD ligase: Enzyme kinetics, protein-inhibitor binding by NMR and a molecular dynamics study. Eur J Med Chem 83:92-101 (2014)  
Target
Name:
UDP-N-acetylmuramoylalanine--D-glutamate ligase
Synonyms:
D-glutamic acid-adding enzyme MurD (E. coli) UDP-N-acetylmuramoyl-L-alanyl-D-glutamate synthetase | murD
Type:
Ligase
Mol. Mass.:
46963.02
Organism:
Escherichia coli (strain K12)
Description:
Residue:
438
  
Inhibitor
Name:
BDBM50021359
Synonyms:
CHEMBL3288597
Type:
Small organic molecule
Emp. Form.:
C17H9N5O5S2
Mol. Mass.:
427.414
SMILES:
[O-][N+](=O)c1ccc2NC(=O)\C(=C3/SC(=S)N(NC(=O)c4cccnc4)C3=O)c2c1
: