Target
Sodium- and chloride-dependent betaine transporter
Ligand
BDBM50021360
Substrate
Meas. Tech.
ChEMBL_1362705 (CHEMBL3294686)
IC50
6457±n/a nM
Citation
 Kowalczyk, PSalat, KHöfner, GCMucha, MRapacz, APodkowa, AFilipek, BWanner, KTKulig, K Synthesis, biological evaluation and structure-activity relationship of new GABA uptake inhibitors, derivatives of 4-aminobutanamides. Eur J Med Chem 83:256-73 (2014)  
Target
Name:
Sodium- and chloride-dependent betaine transporter
Synonyms:
GABA transporter Gabt2 Gat2 Slc6a12
Type:
PROTEIN
Mol. Mass.:
69615.88
Organism:
Mus musculus
Description:
ChEMBL_1460088
Residue:
614
  
Inhibitor
Name:
BDBM50021360
Synonyms:
CHEMBL3289575
Type:
Small organic molecule
Emp. Form.:
C28H32ClN3O
Mol. Mass.:
462.026
SMILES:
[#6]-[#7](-[#6]-[#6]\[#6]=[#6](/c1ccccc1)-c1ccccc1)-[#6](-[#6]-[#6]-[#7])-[#6](=O)-[#7]-[#6]-c1ccccc1Cl
: