Target
Integrin alpha-5/beta-1
Ligand
BDBM50021394
Substrate
Meas. Tech.
ChEMBL_1363103 (CHEMBL3293383)
EC50
763±n/a nM
Citation
 Galletti, PSoldati, RPori, MDurso, MTolomelli, AGentilucci, LDattoli, SDBaiula, MSpampinato, SGiacomini, D Targeting integrinsavß3 anda5ß1 with newß-lactam derivatives. Eur J Med Chem 83:284-93 (2014)  
Target
Name:
Integrin alpha-5/beta-1
Synonyms:
Fibronectin receptor alpha/beta ITGA5/ITGB1
Type:
Enzyme
Mol. Mass.:
Description:
Components:
This complex has 2 components.
Component 1
Name:
Integrin alpha-5
Synonyms:
CD49 antigen-like family member E FNRA Fibronectin receptor subunit alpha ITGA5 Integrin alpha-F | VLA-5
Type:
Single-pass type I membrane protein
Mol. Mass.:
114523.00
Organism:
Homo sapiens (Human)
Description:
Residue:
1049
  
Component 2
Name:
Integrin beta-1
Synonyms:
CD_antigen=CD29 Fibronectin receptor beta GPIIA ITGB1 MDF2 | MSK12
Type:
Enzyme
Mol. Mass.:
88400.38
Organism:
Homo sapiens (Human)
Description:
P05556
Residue:
798
  
Inhibitor
Name:
BDBM50021394
Synonyms:
CHEMBL3289605
Type:
Small organic molecule
Emp. Form.:
C17H19F3N4O7
Mol. Mass.:
448.3506
SMILES:
[O-]C(=O)C(F)(F)F.[NH3+]Cc1ccc(NC(=O)N2C(CC(=O)NCC(O)=O)CC2=O)cc1
: