Target
Interleukin-2
Ligand
BDBM50021397
Substrate
Meas. Tech.
ChEMBL_1363478 (CHEMBL3291700)
Kd
36±n/a nM
Citation
 Chen, LDu, JDai, QZhang, HPang, WHu, J Prediction of anti-tumor chemical probes of a traditional Chinese medicine formula by HPLC fingerprinting combined with molecular docking. Eur J Med Chem 83:294-306 (2014)  
Target
Name:
Interleukin-2
Synonyms:
IL-2 IL2_HUMAN Interleukin-2 T-cell growth factor | TCGF
Type:
Enzyme
Mol. Mass.:
17630.05
Organism:
Homo sapiens (Human)
Description:
P60568
Residue:
153
  
Inhibitor
Name:
BDBM50021397
Synonyms:
CHEMBL3289608
Type:
Small organic molecule
Emp. Form.:
C22H22O10
Mol. Mass.:
446.4041
SMILES:
COc1ccc(cc1O)-c1coc2cc(O[C@@H]3O[C@H](CO)[C@@H](O)[C@H](O)[C@H]3O)ccc2c1=O
: