Target
Tumor necrosis factor
Ligand
BDBM50241242
Substrate
Meas. Tech.
ChEMBL_1363479 (CHEMBL3291701)
Kd
790±n/a nM
Citation
 Chen, LDu, JDai, QZhang, HPang, WHu, J Prediction of anti-tumor chemical probes of a traditional Chinese medicine formula by HPLC fingerprinting combined with molecular docking. Eur J Med Chem 83:294-306 (2014)  
Target
Name:
Tumor necrosis factor
Synonyms:
Cachectin TNF-a TNFA TNFSF2 Tumor necrosis factor (TNFa) Tumor necrosis factor ligand superfamily member 2 Tumor necrosis factor, soluble form | tumor necrosis factor alpha
Type:
Enzyme
Mol. Mass.:
25645.11
Organism:
Homo sapiens (Human)
Description:
P01375
Residue:
233
  
Inhibitor
Name:
BDBM50241242
Synonyms:
2-(3,4-dihydroxyphenyl)-5-hydroxy-4-oxo-4H-chromen-7-yl beta-D-glucopyranoside 7-Glucoluteolin CHEMBL233929 Cynaroside Luteolin 7-O-glucopyranoside Luteolin 7-glucoside Luteolin-7-glucoside cid_5280637 | luteolin 7-O-beta-D-glucoside
Type:
Small organic molecule
Emp. Form.:
C21H20O11
Mol. Mass.:
448.3769
SMILES:
OC[C@H]1O[C@@H](Oc2cc(O)c3c(c2)oc(cc3=O)-c2ccc(O)c(O)c2)[C@H](O)[C@@H](O)[C@@H]1O
: