Target
Tumor necrosis factor
Ligand
BDBM50359037
Substrate
Meas. Tech.
ChEMBL_1363479 (CHEMBL3291701)
Kd
8±n/a nM
Citation
 Chen, LDu, JDai, QZhang, HPang, WHu, J Prediction of anti-tumor chemical probes of a traditional Chinese medicine formula by HPLC fingerprinting combined with molecular docking. Eur J Med Chem 83:294-306 (2014)  
Target
Name:
Tumor necrosis factor
Synonyms:
Cachectin TNF-a TNFA TNFSF2 Tumor necrosis factor (TNFa) Tumor necrosis factor ligand superfamily member 2 Tumor necrosis factor, soluble form | tumor necrosis factor alpha
Type:
Enzyme
Mol. Mass.:
25645.11
Organism:
Homo sapiens (Human)
Description:
P01375
Residue:
233
  
Inhibitor
Name:
BDBM50359037
Synonyms:
CHEMBL602899
Type:
Small organic molecule
Emp. Form.:
C30H44O7
Mol. Mass.:
516.6662
SMILES:
C[C@H](CC(=O)C[C@@H](C)C(O)=O)[C@H]1C[C@@H](O)[C@@]2(C)C3=C(C(=O)C[C@@]12C)[C@@]1(C)CCC(=O)C(C)(C)[C@H]1C[C@@H]3O
: