Target
Prostaglandin G/H synthase 1
Ligand
BDBM50021508
Substrate
Meas. Tech.
ChEMBL_1363515 (CHEMBL3292006)
IC50
>1000000±n/a nM
Citation
 Abuo-Rahma, Gel-DAbdel-Aziz, MFarag, NAKaoud, TS Novel 1-[4-(Aminosulfonyl)phenyl]-1H-1,2,4-triazole derivatives with remarkable selective COX-2 inhibition: design, synthesis, molecular docking, anti-inflammatory and ulcerogenicity studies. Eur J Med Chem 83:398-408 (2014)  
Target
Name:
Prostaglandin G/H synthase 1
Synonyms:
COX1 Cyclooxygenase-1 (COX-1) PTGS1 | Prostaglandin G/H synthase (cyclooxygenase)
Type:
Protein
Mol. Mass.:
68868.60
Organism:
Ovis aries (Sheep)
Description:
Residue:
600
  
Inhibitor
Name:
BDBM50021508
Synonyms:
CHEMBL3290201
Type:
Small organic molecule
Emp. Form.:
C22H19N5O4S
Mol. Mass.:
449.482
SMILES:
COc1ccc(NC(=O)c2nc(-c3ccccc3)n(n2)-c2ccc(cc2)S(N)(=O)=O)cc1
: