Target
Prostaglandin G/H synthase 2
Ligand
BDBM50021508
Substrate
Meas. Tech.
ChEMBL_1363516 (CHEMBL3292007)
IC50
890±n/a nM
Citation
 Abuo-Rahma, Gel-DAbdel-Aziz, MFarag, NAKaoud, TS Novel 1-[4-(Aminosulfonyl)phenyl]-1H-1,2,4-triazole derivatives with remarkable selective COX-2 inhibition: design, synthesis, molecular docking, anti-inflammatory and ulcerogenicity studies. Eur J Med Chem 83:398-408 (2014)  
Target
Name:
Prostaglandin G/H synthase 2
Synonyms:
COX2 Cyclooxygenase 2 (COX-2) Cyclooxygenase-2 (COX-2 AA) Cyclooxygenase-2 (COX-2) PGH2_HUMAN PHS II Prostaglandin E synthase/G/H synthase 2 Prostaglandin-endoperoxide synthase 2
Type:
Enzyme
Mol. Mass.:
69003.89
Organism:
Homo sapiens (Human)
Description:
Recombinant Cox-2 provided by Cayman (Cayman Chemical Co.,Ann Arbor, MI).
Residue:
604
  
Inhibitor
Name:
BDBM50021508
Synonyms:
CHEMBL3290201
Type:
Small organic molecule
Emp. Form.:
C22H19N5O4S
Mol. Mass.:
449.482
SMILES:
COc1ccc(NC(=O)c2nc(-c3ccccc3)n(n2)-c2ccc(cc2)S(N)(=O)=O)cc1
: