Target
Hepatocyte growth factor receptor
Ligand
BDBM50399540
Substrate
Meas. Tech.
ChEMBL_1364700 (CHEMBL3293742)
IC50
1.2±n/a nM
Citation
 Zhou, SLiao, HHe, CDou, YJiang, MRen, LZhao, YGong, P Design, synthesis and structure-activity relationships of novel 4-phenoxyquinoline derivatives containing pyridazinone moiety as potential antitumor agents. Eur J Med Chem 83:581-93 (2014)  
Target
Name:
Hepatocyte growth factor receptor
Synonyms:
Hepatocyte growth factor receptor Hepatocyte growth factor receptor (c-MET) MET Met proto-oncogene (hepatocyte growth factor receptor) Tyrosine-protein kinase Met (c-Met) c-Met kinase
Type:
Protein
Mol. Mass.:
155559.73
Organism:
Homo sapiens (Human)
Description:
P08581
Residue:
1390
  
Inhibitor
Name:
BDBM50399540
Synonyms:
FORETINIB US10882853, Compound For-Oxide
Type:
Small organic molecule
Emp. Form.:
C34H34F2N4O6
Mol. Mass.:
632.6538
SMILES:
COc1cc2c(Oc3ccc(NC(=O)C4(CC4)C(=O)Nc4ccc(F)cc4)cc3F)ccnc2cc1OCCCN1CCOCC1
: