Target
Tyrosine-protein kinase JAK2
Ligand
BDBM50021656
Substrate
Meas. Tech.
ChEMBL_1368161 (CHEMBL3299209)
IC50
88±n/a nM
Citation
 Clark, JDFlanagan, METelliez, JB Discovery and development of Janus kinase (JAK) inhibitors for inflammatory diseases. J Med Chem 57:5023-38 (2014)  
Target
Name:
Tyrosine-protein kinase JAK2
Synonyms:
JAK-2 JAK2_HUMAN Janus kinase 2 (JAK2) | Janus kinase 2 (a protein tyrosine kinase)
Type:
Protein
Mol. Mass.:
130684.68
Organism:
Homo sapiens (Human)
Description:
O60674
Residue:
1132
  
Inhibitor
Name:
BDBM50021656
Synonyms:
BARICITINIB LY-3009104 US10766894, Compound TABLE 1.19 US11203595, TABLE 1.19 US20230416237, Example baricitinib
Type:
Small organic molecule
Emp. Form.:
C16H17N7O2S
Mol. Mass.:
371.417
SMILES:
CCS(=O)(=O)N1CC(CC#N)(C1)n1cc(cn1)-c1ncnc2[nH]ccc12
: