Target
Epidermal growth factor receptor
Ligand
BDBM50001839
Substrate
Meas. Tech.
ChEMBL_1368552 (CHEMBL3300694)
IC50
>10000±n/a nM
Citation
 Marzaro, GColuccia, AFerrarese, ABrun, PCastagliuolo, IConconi, MTLa Regina, GBai, RSilvestri, RHamel, EChilin, A Discovery of biarylaminoquinazolines as novel tubulin polymerization inhibitors. J Med Chem 57:4598-605 (2014)  
Target
Name:
Epidermal growth factor receptor
Synonyms:
EGF Receptor Substrate EGFR_HUMAN ERBB1 Epidermal Growth Factor Receptor erbB-1 Epidermal growth factor receptor (EGFR) HER1 Proto-oncogene c-ErbB-1 Tyrosine-Protein Kinase ErbB-1
Type:
Receptor Kinase Domain
Mol. Mass.:
134279.59
Organism:
Homo sapiens (Human)
Description:
P00533
Residue:
1210
  
Inhibitor
Name:
BDBM50001839
Synonyms:
CHEMBL428647 taxol
Type:
Small organic molecule
Emp. Form.:
C47H51NO14
Mol. Mass.:
853.9061
SMILES:
CC(=O)O[C@@H]1C2=C(C)[C@H](C[C@@](O)([C@@H](OC(=O)c3ccccc3)[C@@H]3[C@@]4(CO[C@@H]4C[C@H](O)[C@@]3(C)C1=O)OC(C)=O)C2(C)C)OC(=O)[C@H](O)[C@@H](NC(=O)c1ccccc1)c1ccccc1
: