Target
D(2) dopamine receptor
Ligand
BDBM50021770
Substrate
Meas. Tech.
ChEMBL_1369055 (CHEMBL3300168)
EC50
0.300000±n/a nM
Citation
 Szabo, MKlein Herenbrink, CChristopoulos, ALane, JRCapuano, B Structure-activity relationships of privileged structures lead to the discovery of novel biased ligands at the dopamine D2 receptor. J Med Chem 57:4924-39 (2014)  
Target
Name:
D(2) dopamine receptor
Synonyms:
D(2) dopamine receptor DOPAMINE D2 Long DRD2 Dopamine D2 receptor Dopamine D2 receptor (D2R) Dopamine2-like | d2
Type:
Cell-surface receptors
Mol. Mass.:
50647.10
Organism:
Homo sapiens (Human)
Description:
P14416
Residue:
443
  
Inhibitor
Name:
BDBM50021770
Synonyms:
CHEMBL3298895
Type:
Small organic molecule
Emp. Form.:
C25H31Cl2N5OS
Mol. Mass.:
520.518
SMILES:
Cc1cc(C)c2c(N)c(sc2n1)C(=O)NCCCCCN1CCN(CC1)c1cccc(Cl)c1Cl
: