Target
D(2) dopamine receptor
Ligand
BDBM50001862
Substrate
Meas. Tech.
ChEMBL_1369051 (CHEMBL3300164)
IC50
>1000±n/a nM
Citation
 Szabo, MKlein Herenbrink, CChristopoulos, ALane, JRCapuano, B Structure-activity relationships of privileged structures lead to the discovery of novel biased ligands at the dopamine D2 receptor. J Med Chem 57:4924-39 (2014)  
Target
Name:
D(2) dopamine receptor
Synonyms:
D(2) dopamine receptor DOPAMINE D2 Long DRD2 Dopamine D2 receptor Dopamine D2 receptor (D2R) Dopamine2-like | d2
Type:
Cell-surface receptors
Mol. Mass.:
50647.10
Organism:
Homo sapiens (Human)
Description:
P14416
Residue:
443
  
Inhibitor
Name:
BDBM50001862
Synonyms:
(N-(o-methoxyphenyl)piperazine)1-(2-Methoxy-phenyl)-piperazine 2-METHOXYPHENYLPIPERAZINE CHEMBL9666 | EN300-33366
Type:
Small organic molecule
Emp. Form.:
C11H16N2O
Mol. Mass.:
192.2575
SMILES:
COc1ccccc1N1CCNCC1
: