Target
D(2) dopamine receptor
Ligand
BDBM50021796
Substrate
Meas. Tech.
ChEMBL_1369053 (CHEMBL3300166)
EC50
0.390000±n/a nM
Citation
 Szabo, MKlein Herenbrink, CChristopoulos, ALane, JRCapuano, B Structure-activity relationships of privileged structures lead to the discovery of novel biased ligands at the dopamine D2 receptor. J Med Chem 57:4924-39 (2014)  
Target
Name:
D(2) dopamine receptor
Synonyms:
D(2) dopamine receptor DOPAMINE D2 Long DRD2 Dopamine D2 receptor Dopamine D2 receptor (D2R) Dopamine2-like | d2
Type:
Cell-surface receptors
Mol. Mass.:
50647.10
Organism:
Homo sapiens (Human)
Description:
P14416
Residue:
443
  
Inhibitor
Name:
BDBM50021796
Synonyms:
CHEMBL3299094
Type:
Small organic molecule
Emp. Form.:
C19H31N3O3
Mol. Mass.:
349.4677
SMILES:
COc1ccccc1N1CCN(CCCNC(=O)OC(C)(C)C)CC1
: