Target
Transient receptor potential cation channel subfamily A member 1
Ligand
BDBM50021827
Substrate
Meas. Tech.
ChEMBL_1369154 (CHEMBL3300585)
IC50
710±n/a nM
Citation
 Hu, YJSt-Onge, MLaliberté, SVallée, FJin, SBedard, LLabrecque, JAlbert, JS Discovery of a 4-aryloxy-1H-pyrrolo[3,2-c]pyridine and a 1-aryloxyisoquinoline series of TRPA1 antagonists. Bioorg Med Chem Lett 24:3199-203 (2014)  
Target
Name:
Transient receptor potential cation channel subfamily A member 1
Synonyms:
ANKTM1 TRPA1 Transformation-sensitive protein p120 | Transient receptor potential cation channel subfamily A member 1 (TRPA1)
Type:
Protein
Mol. Mass.:
127514.20
Organism:
Homo sapiens (Human)
Description:
O75762
Residue:
1119
  
Inhibitor
Name:
BDBM50021827
Synonyms:
CHEMBL3298430
Type:
Small organic molecule
Emp. Form.:
C12H7F2N3O
Mol. Mass.:
247.2003
SMILES:
Fc1ccc(Oc2ncnc3[nH]ccc23)c(F)c1
: