Target
Cytochrome P450 2C19
Ligand
BDBM50021822
Substrate
Meas. Tech.
ChEMBL_1369166 (CHEMBL3300597)
IC50
1900±n/a nM
Citation
 Hu, YJSt-Onge, MLaliberté, SVallée, FJin, SBedard, LLabrecque, JAlbert, JS Discovery of a 4-aryloxy-1H-pyrrolo[3,2-c]pyridine and a 1-aryloxyisoquinoline series of TRPA1 antagonists. Bioorg Med Chem Lett 24:3199-203 (2014)  
Target
Name:
Cytochrome P450 2C19
Synonyms:
(R)-limonene 6-monooxygenase (S)-limonene 7-monooxygenase CYP2C19 CYPIIC19 Cytochrome P450 2C19 [I331V] Cytochrome P450-254C Mephenytoin 4-hydroxylase P450-254C
Type:
Enzyme
Mol. Mass.:
55935.47
Organism:
Homo sapiens (Human)
Description:
P33261
Residue:
490
  
Inhibitor
Name:
BDBM50021822
Synonyms:
CHEMBL3298322
Type:
Small organic molecule
Emp. Form.:
C17H14FNO3
Mol. Mass.:
299.2964
SMILES:
COc1cc2ccnc(Oc3ccc(F)cc3)c2cc1OC
: