Target
Cytochrome P450 1A2
Ligand
BDBM50021823
Substrate
Meas. Tech.
ChEMBL_1369164 (CHEMBL3300595)
IC50
>20000±n/a nM
Citation
 Hu, YJSt-Onge, MLaliberté, SVallée, FJin, SBedard, LLabrecque, JAlbert, JS Discovery of a 4-aryloxy-1H-pyrrolo[3,2-c]pyridine and a 1-aryloxyisoquinoline series of TRPA1 antagonists. Bioorg Med Chem Lett 24:3199-203 (2014)  
Target
Name:
Cytochrome P450 1A2
Synonyms:
CP1A2_HUMAN CYPIA2 Cytochrome P(3)450 Cytochrome P450 1A2 (CYP1A2) Cytochrome P450-P3
Type:
Enzyme
Mol. Mass.:
58423.38
Organism:
Homo sapiens (Human)
Description:
P05177
Residue:
516
  
Inhibitor
Name:
BDBM50021823
Synonyms:
CHEMBL3298431
Type:
Small organic molecule
Emp. Form.:
C12H8FN3O
Mol. Mass.:
229.2098
SMILES:
Fc1ccc(Oc2ncnc3[nH]ccc23)cc1
: