Target
Transient receptor potential cation channel subfamily V member 1
Ligand
BDBM50021821
Substrate
Meas. Tech.
ChEMBL_1369156 (CHEMBL3300587)
IC50
>10000±n/a nM
Citation
 Hu, YJSt-Onge, MLaliberté, SVallée, FJin, SBedard, LLabrecque, JAlbert, JS Discovery of a 4-aryloxy-1H-pyrrolo[3,2-c]pyridine and a 1-aryloxyisoquinoline series of TRPA1 antagonists. Bioorg Med Chem Lett 24:3199-203 (2014)  
Target
Name:
Transient receptor potential cation channel subfamily V member 1
Synonyms:
Capsaicin receptor Osm-9-like TRP channel 1 TRPV1_HUMAN Transient receptor potential cation channel subfamily V member 1 (TRPV1) Transient receptor potential cation channel subfamily V member 1(TRPV1) Vanilloid VR1 Vanilloid receptor 1 Vanilloid receptor 1 (VRI/TRPV1)
Type:
Protein
Mol. Mass.:
94960.75
Organism:
Homo sapiens (Human)
Description:
Q8NER1
Residue:
839
  
Inhibitor
Name:
BDBM50021821
Synonyms:
CHEMBL3298760
Type:
Small organic molecule
Emp. Form.:
C13H8F2N2O
Mol. Mass.:
246.2122
SMILES:
Fc1ccc(Oc2nccc3[nH]ccc23)c(F)c1
: