Target
Beta-2 adrenergic receptor
Ligand
BDBM50021888
Substrate
Meas. Tech.
ChEMBL_1369174 (CHEMBL862902)
Ki
1.000000±n/a nM
Citation
 McKinnell, RMKlein, ULinsell, MSMoran, EJNodwell, MBPfeiffer, JWThomas, GRYu, CJacobsen, JR Discovery of TD-4306, a long-actingß2-agonist for the treatment of asthma and COPD. Bioorg Med Chem Lett 24:2871-6 (2014)  
Target
Name:
Beta-2 adrenergic receptor
Synonyms:
ADRB2 ADRB2_HUMAN Beta-2 adrenoceptor | Beta-2 adrenoreceptor
Type:
Mol. Mass.:
46461.69
Organism:
Homo sapiens (Human)
Description:
P07550
Residue:
413
  
Inhibitor
Name:
BDBM50021888
Synonyms:
CHEMBL3298987
Type:
Small organic molecule
Emp. Form.:
C35H38N4O4
Mol. Mass.:
578.7006
SMILES:
CC(C)(N)COc1ccc(Nc2ccc(CCNC[C@H](O)c3ccc(O)c4[nH]c(=O)ccc34)cc2)cc1-c1ccccc1
: