Target
cGMP-specific 3',5'-cyclic phosphodiesterase
Ligand
BDBM50059020
Substrate
Meas. Tech.
ChEMBL_1367230 (CHEMBL3299911)
IC50
5600±n/a nM
Citation
 Mittal, APaliwal, SSharma, MSingh, ASharma, SYadav, D Pharmacophore based virtual screening, molecular docking and biological evaluation to identify novel PDE5 inhibitors with vasodilatory activity. Bioorg Med Chem Lett 24:3137-41 (2014)  
Target
Name:
cGMP-specific 3',5'-cyclic phosphodiesterase
Synonyms:
3',5'-cyclic phosphodiesterase PDE5 PDE5A_HUMAN Phosphodiesterase 5 (PDE5) Phosphodiesterase 5A (PDE5A) cGMP-specific 3',5'-cyclic phosphodiesterase
Type:
Protein
Mol. Mass.:
99975.83
Organism:
Homo sapiens (Human)
Description:
O76074
Residue:
875
  
Inhibitor
Name:
BDBM50059020
Synonyms:
(6aR,9aS)-2-[(N,N-Dimethylamino)methyl]-5,6a,7,8,9,9a-hexahydro-5-methyl-3-(phenylmethyl)cyclopent[4,5]imidazo[2,1-b]purin-4(3H)-one | CHEMBL69324
Type:
Small organic molecule
Emp. Form.:
C21H26N6O
Mol. Mass.:
378.4707
SMILES:
CN(C)Cc1nc2N3[C@H]4CCC[C@H]4N=C3N(C)C(=O)c2n1Cc1ccccc1
: