Target
G-protein coupled receptor 52
Ligand
BDBM50022189
Substrate
Meas. Tech.
ChEMBL_1367592
EC50
43±n/a nM
Citation
 Setoh, MIshii, NKono, MMiyanohana, YShiraishi, EHarasawa, TOta, HOdani, TKanzaki, NAoyama, KHamada, TKori, M Discovery of the first potent and orally available agonist of the orphan G-protein-coupled receptor 52. J Med Chem 57:5226-37 (2014)  
Target
Name:
G-protein coupled receptor 52
Synonyms:
GPR52 Probable G-protein coupled receptor 52
Type:
PROTEIN
Mol. Mass.:
41366.15
Organism:
Homo sapiens (Human)
Description:
ChEMBL_108391
Residue:
361
  
Inhibitor
Name:
BDBM50022189
Synonyms:
CHEMBL3297811
Type:
Small organic molecule
Emp. Form.:
C26H22F3NO2S
Mol. Mass.:
469.519
SMILES:
COCCNC(=O)c1cccc(c1)-c1cccc2cc(Cc3cccc(c3)C(F)(F)F)sc12
: