Target
Transient receptor potential cation channel subfamily A member 1
Ligand
BDBM50022327
Substrate
Meas. Tech.
ChEMBL_1367709 (CHEMBL3299553)
IC50
161±n/a nM
Citation
 Rooney, LVidal, AD'Souza, AMDevereux, NMasick, BBoissel, VWest, RHead, VStringer, RLao, JPetrus, MJPatapoutian, ANash, MStoakley, NPanesar, MVerkuyl, JMSchumacher, AMPetrassi, HMTully, DC Discovery, optimization, and biological evaluation of 5-(2-(trifluoromethyl)phenyl)indazoles as a novel class of transient receptor potential A1 (TRPA1) antagonists. J Med Chem 57:5129-40 (2014)  
Target
Name:
Transient receptor potential cation channel subfamily A member 1
Synonyms:
Anktm1 Trpa1
Type:
PROTEIN
Mol. Mass.:
128485.09
Organism:
Mus musculus
Description:
ChEMBL_1367709
Residue:
1125
  
Inhibitor
Name:
BDBM50022327
Synonyms:
CHEMBL3299019
Type:
Small organic molecule
Emp. Form.:
C15H11F3N2O
Mol. Mass.:
292.2558
SMILES:
COc1cc2[nH]ncc2cc1-c1ccccc1C(F)(F)F
: