Target
Chitinase
Ligand
BDBM50022825
Substrate
Meas. Tech.
ChEMBL_1369100 (CHEMBL3300321)
IC50
3710±n/a nM
Citation
 Gooyit, MTricoche, NLustigman, SJanda, KD Dual protonophore-chitinase inhibitors dramatically affect O. volvulus molting. J Med Chem 57:5792-9 (2014)  
Target
Name:
Chitinase
Synonyms:
Type:
PROTEIN
Mol. Mass.:
55694.80
Organism:
Onchocerca volvulus
Description:
ChEMBL_1369100
Residue:
497
  
Inhibitor
Name:
BDBM50022825
Synonyms:
CHEMBL3298098
Type:
Small organic molecule
Emp. Form.:
C21H17I2NO3
Mol. Mass.:
585.1735
SMILES:
COc1c(I)cc(I)cc1C(=O)N(C)c1ccc(Oc2ccccc2)cc1
: