Target
Chitinase
Ligand
BDBM50022828
Substrate
Meas. Tech.
ChEMBL_1369100 (CHEMBL3300321)
IC50
1570±n/a nM
Citation
 Gooyit, MTricoche, NLustigman, SJanda, KD Dual protonophore-chitinase inhibitors dramatically affect O. volvulus molting. J Med Chem 57:5792-9 (2014)  
Target
Name:
Chitinase
Synonyms:
Type:
PROTEIN
Mol. Mass.:
55694.80
Organism:
Onchocerca volvulus
Description:
ChEMBL_1369100
Residue:
497
  
Inhibitor
Name:
BDBM50022828
Synonyms:
CHEMBL3298101
Type:
Small organic molecule
Emp. Form.:
C19H12FI2NO3
Mol. Mass.:
575.1108
SMILES:
Oc1c(I)cc(I)cc1C(=O)Nc1ccc(Oc2ccc(F)cc2)cc1
: