Target
1,25-dihydroxyvitamin D(3) 24-hydroxylase, mitochondrial
Ligand
BDBM50023355
Substrate
Meas. Tech.
ChEMBL_1459633 (CHEMBL3369890)
Ki
11±n/a nM
Citation
 Ferla, SAboraia, ASBrancale, APepper, CJZhu, JOchalek, JTDeLuca, HFSimons, C Small-molecule inhibitors of 25-hydroxyvitamin D-24-hydroxylase (CYP24A1): synthesis and biological evaluation. J Med Chem 57:7702-15 (2014)  
Target
Name:
1,25-dihydroxyvitamin D(3) 24-hydroxylase, mitochondrial
Synonyms:
1,25-dihydroxyvitamin D(3) 24-hydroxylase, mitochondrial CYP24 Cytochrome P450 24A1
Type:
Protein
Mol. Mass.:
58889.66
Organism:
Homo sapiens (Human)
Description:
Q07973
Residue:
514
  
Inhibitor
Name:
BDBM50023355
Synonyms:
CHEMBL3329774
Type:
Small organic molecule
Emp. Form.:
C27H32N2O4
Mol. Mass.:
448.554
SMILES:
COc1cc(OC)cc(\C=C\c2ccc(CCC(OC(=O)n3ccnc3)C(C)(C)C)cc2)c1
: