Target
Nitric oxide synthase, endothelial
Ligand
BDBM152723
Substrate
Meas. Tech.
ChEMBL_1446356 (CHEMBL3374895)
Ki
3170±n/a nM
Citation
 Jing, QLi, HRoman, LJMartásek, PPoulos, TLSilverman, RB Combination of chiral linkers with thiophenecarboximidamide heads to improve the selectivity of inhibitors of neuronal nitric oxide synthase. Bioorg Med Chem Lett 24:4504-10 (2014)  
Target
Name:
Nitric oxide synthase, endothelial
Synonyms:
Constitutive NOS Endothelial nitric oxide synthase NOS type III NOS3_BOVIN Nitric-oxide synthase, endothelial | cNOS
Type:
Enzyme
Mol. Mass.:
133292.26
Organism:
Bos taurus (bovine)
Description:
Recombinant eNOS overexpressed in E. coli was used in enzyme assays.
Residue:
1205
  
Inhibitor
Name:
BDBM152723
Synonyms:
N-[3-({[(3S,5R)-5-({[3-(thiophene-2-imidamido)phenyl]methoxy}methyl)pyrrolidin-3-yl]oxy}methyl)phenyl]-2H-1λ⁴-thiophene-2-carboximidamide (28)
Type:
Small organic molecule
Emp. Form.:
C29H31N5O2S2
Mol. Mass.:
545.719
SMILES:
N=C(Nc1cccc(COC[C@H]2C[C@@H](CN2)OCc2cccc(NC(=N)c3cccs3)c2)c1)c1cccs1
: