Target
Genome polyprotein
Ligand
BDBM50023577
Substrate
Meas. Tech.
ChEMBL_1452511 (CHEMBL3362860)
IC50
<1000±n/a nM
Citation
 Parsy, CAlexandre, FRBrandt, GCaillet, CCappelle, SChaves, DConvard, TDerock, MGloux, DGriffon, YLallos, LLeroy, FLiuzzi, MLoi, AGMoulat, LMusiu, CRahali, HRoques, VSeifer, MStandring, DSurleraux, D Structure-based design of a novel series of azetidine inhibitors of the hepatitis C virus NS3/4A serine protease. Bioorg Med Chem Lett 24:4444-9 (2014)  
Target
Name:
Genome polyprotein
Synonyms:
Nonstructural protein NS3-4A
Type:
PROTEIN
Mol. Mass.:
71633.49
Organism:
Hepatitis C virus
Description:
ChEMBL_109716
Residue:
674
  
Inhibitor
Name:
BDBM50023577
Synonyms:
CHEMBL3326828
Type:
Small organic molecule
Emp. Form.:
C36H43ClN6O7S2
Mol. Mass.:
771.346
SMILES:
[H][C@]12C[C@@]1(NC(=O)N1[C@H](COc3cc(nc4c(Cl)c(OC)ccc34)-c3nc(cs3)C(C)C)C[C@@]1([H])C(=O)N(C)CCCC\C=C/2)C(=O)NS(=O)(=O)C1CC1
: