Target
Genome polyprotein
Ligand
BDBM50142916
Substrate
Meas. Tech.
ChEMBL_1452511 (CHEMBL3362860)
IC50
0.800000±n/a nM
Citation
 Parsy, CAlexandre, FRBrandt, GCaillet, CCappelle, SChaves, DConvard, TDerock, MGloux, DGriffon, YLallos, LLeroy, FLiuzzi, MLoi, AGMoulat, LMusiu, CRahali, HRoques, VSeifer, MStandring, DSurleraux, D Structure-based design of a novel series of azetidine inhibitors of the hepatitis C virus NS3/4A serine protease. Bioorg Med Chem Lett 24:4444-9 (2014)  
Target
Name:
Genome polyprotein
Synonyms:
Nonstructural protein NS3-4A
Type:
PROTEIN
Mol. Mass.:
71633.49
Organism:
Hepatitis C virus
Description:
ChEMBL_109716
Residue:
674
  
Inhibitor
Name:
BDBM50142916
Synonyms:
(1S,4R,6S,14S,18R)-14-Cyclopentyloxycarbonylamino-18-[2-(2-isopropylamino-thiazol-4-yl)-7-methoxy-quinolin-4-yloxy]-2,15-dioxo-3,16-diaza-tricyclo[14.3.0.0*4,6*]nonadec-7-ene-4-carboxylic acid (2R,6S,13aS,14aR,16aS,Z)-6-(cyclopentyloxycarbonylamino)-2-(2-(2-(isopropylamino)thiazol-4-yl)-7-methoxyquinolin-4-yloxy)-5,16-dioxo-1,2,3,5,6,7,8,9,10,11,13a,14,14a,15,16,16a-hexadecahydrocyclopropa[e]pyrrolo[1,2-a][1,4]diazacyclopentadecine-14a-carboxylic acid BILN 2061 | CHEMBL297884
Type:
Small organic molecule
Emp. Form.:
C40H50N6O8S
Mol. Mass.:
774.925
SMILES:
COc1ccc2c(O[C@@H]3C[C@@H]4N(C3)C(=O)[C@H](CCCCC\C=C/[C@@H]3C[C@]3(NC4=O)C(O)=O)NC(=O)OC3CCCC3)cc(nc2c1)-c1csc(NC(C)C)n1
: