Target
Cytochrome P450 11B1, mitochondrial
Ligand
BDBM50023771
Substrate
Meas. Tech.
ChEMBL_1434492 (CHEMBL3388878)
IC50
5.0±n/a nM
Citation
 Zhu, WHu, QHanke, Nvan Koppen, CJHartmann, RW Potent 11ß-hydroxylase inhibitors with inverse metabolic stability in human plasma and hepatic S9 fractions to promote wound healing. J Med Chem 57:7811-7 (2014)  
Target
Name:
Cytochrome P450 11B1, mitochondrial
Synonyms:
C11B1_HUMAN CYPXIB1 Cytochrome P450 11B1 Cytochrome P450 11B1, mitochondrial | S11BH
Type:
Enzyme
Mol. Mass.:
57591.44
Organism:
Homo sapiens (Human)
Description:
P15538
Residue:
503
  
Inhibitor
Name:
BDBM50023771
Synonyms:
CHEMBL3337695
Type:
Small organic molecule
Emp. Form.:
C22H22N2O3S
Mol. Mass.:
394.487
SMILES:
COc1cccc(c1)S(=O)(=O)N1CCCc2cc(Cc3cccnc3)ccc12
: