Target
Serine/threonine-protein kinase 17B
Ligand
BDBM50024284
Substrate
Meas. Tech.
ChEMBL_1435952 (CHEMBL3382262)
IC50
1470±n/a nM
Citation
 Gao, LJKovackova, SSála, MRamadori, ATDe Jonghe, SHerdewijn, P Discovery of dual death-associated protein related apoptosis inducing protein kinase 1 and 2 inhibitors by a scaffold hopping approach. J Med Chem 57:7624-43 (2014)  
Target
Name:
Serine/threonine-protein kinase 17B
Synonyms:
DRAK2 STK17B Serine/threonine-protein kinase 17B (STK17B)
Type:
Enzyme
Mol. Mass.:
42332.49
Organism:
Homo sapiens (Human)
Description:
O94768
Residue:
372
  
Inhibitor
Name:
BDBM50024284
Synonyms:
CHEMBL3334979
Type:
Small organic molecule
Emp. Form.:
C22H24N2O3S
Mol. Mass.:
396.503
SMILES:
COc1ccc(cc1OC)-c1cnc2scc(NC(=O)C3CCCCC3)c2c1
: