Target
Coagulation factor X
Ligand
BDBM50024360
Substrate
Meas. Tech.
ChEMBL_1435960 (CHEMBL3382270)
IC50
710±n/a nM
Citation
 Xue, TDing, SGuo, BZhou, YSun, PWang, HChu, WGong, GWang, YChen, XYang, Y Design, synthesis, and structure-activity and structure-pharmacokinetic relationship studies of novel [6,6,5] tricyclic fused oxazolidinones leading to the discovery of a potent, selective, and orally bioavailable FXa inhibitor. J Med Chem 57:7770-91 (2014)  
Target
Name:
Coagulation factor X
Synonyms:
Activated coagulation factor X (FXa) Coagulation factor X precursor F10 Factor X heavy chain Factor Xa Stuart-Prower factor
Type:
Enzyme
Mol. Mass.:
54726.60
Organism:
Homo sapiens (Human)
Description:
Residue:
488
  
Inhibitor
Name:
BDBM50024360
Synonyms:
CHEMBL3330464
Type:
Small organic molecule
Emp. Form.:
C21H19ClN4O6
Mol. Mass.:
458.852
SMILES:
[H][C@@]12COc3cc(ccc3N1C(=O)O[C@H]2CNC(=O)c1ccc(Cl)cn1)N1CCOCC1=O
: