Target
5-hydroxytryptamine receptor 1A
Ligand
BDBM50024574
Substrate
Meas. Tech.
ChEMBL_1438097 (CHEMBL3387898)
EC50
0.200000±n/a nM
Citation
 Kumar, JSMajo, VJPrabhakaran, JMann, JJ Synthesis and evaluation of arylpiperazines derivatives of 3,5-dioxo-(2H,4H)-1,2,4-triazine as 5-HT1AR ligands. Bioorg Med Chem Lett 24:4759-62 (2014)  
Target
Name:
5-hydroxytryptamine receptor 1A
Synonyms:
5-HT-1A 5-hydroxytryptamine receptor 1A (5-HT-1A) ADRB2RL1 Dopamine D2 receptor and serotonin 1a receptor HTR1A | Serotonin receptor 1A
Type:
Mol. Mass.:
46122.49
Organism:
Homo sapiens (Human)
Description:
Residue:
422
  
Inhibitor
Name:
BDBM50024574
Synonyms:
CHEMBL3330616
Type:
Small organic molecule
Emp. Form.:
C17H23FN6O2
Mol. Mass.:
362.4019
SMILES:
Cn1c(=O)cnn(CCCCN2CCN(CC2)c2cccc(F)n2)c1=O
: