Target
4-hydroxyphenylpyruvate dioxygenase
Ligand
BDBM50024728
Substrate
Meas. Tech.
ChEMBL_1438115 (CHEMBL3388490)
Ki
19±n/a nM
Citation
 Xu, YLLin, HYCao, RJMing, ZZYang, WCYang, GF Pyrazolone-quinazolone hybrids: a novel class of human 4-hydroxyphenylpyruvate dioxygenase inhibitors. Bioorg Med Chem 22:5194-211 (2014)  
Target
Name:
4-hydroxyphenylpyruvate dioxygenase
Synonyms:
4-hydroxyphenylpyruvate dioxygenase 4HPPD HPPD_HUMAN | PPD
Type:
PROTEIN
Mol. Mass.:
44937.33
Organism:
Homo sapiens (Human)
Description:
ChEMBL_123
Residue:
393
  
Inhibitor
Name:
BDBM50024728
Synonyms:
CHEMBL3342431
Type:
Small organic molecule
Emp. Form.:
C20H16N4O3
Mol. Mass.:
360.366
SMILES:
Cc1nc2ccc(cc2c(=O)n1-c1ccccc1)C(=O)c1cnn(C)c1O
: