Target
Acetylcholinesterase
Ligand
BDBM50024876
Substrate
Meas. Tech.
ChEMBL_1439641 (CHEMBL3383711)
IC50
4100±n/a nM
Citation
 Gulcan, HOUnlu, SEsiringu, IErcetin, TSahin, YOz, DSahin, MF Design, synthesis and biological evaluation of novel 6H-benzo[c]chromen-6-one, and 7,8,9,10-tetrahydro-benzo[c]chromen-6-one derivatives as potential cholinesterase inhibitors. Bioorg Med Chem 22:5141-54 (2014)  
Target
Name:
Acetylcholinesterase
Synonyms:
ACES_HUMAN Acetylcholinesterase (AChE) | Acetylcholinesterase (human AChE)
Type:
Enzyme
Mol. Mass.:
67792.70
Organism:
Homo sapiens (Human)
Description:
P22303
Residue:
614
  
Inhibitor
Name:
BDBM50024876
Synonyms:
CHEMBL3335064
Type:
Small organic molecule
Emp. Form.:
C28H29NO3
Mol. Mass.:
427.5348
SMILES:
O=c1oc2cc(OCCCN3CCC(Cc4ccccc4)CC3)ccc2c2ccccc12
: