Target
Muscarinic acetylcholine receptor M2
Ligand
BDBM50025027
Substrate
Meas. Tech.
ChEMBL_1442051 (CHEMBL3373419)
EC50
36±n/a nM
Citation
 Zlotos, DPTränkle, CHolzgrabe, UGündisch, DJensen, AA Semisynthetic analogues of toxiferine I and their pharmacological properties ata7 nAChRs, muscle-type nAChRs, and the allosteric binding site of muscarinic M2 receptors. J Nat Prod 77:2006-13 (2014)  
Target
Name:
Muscarinic acetylcholine receptor M2
Synonyms:
ACM2_PIG Cholinergic, muscarinic LOC100715343 Muscarinic receptor 2
Type:
Enzyme Catalytic Domain
Mol. Mass.:
51688.65
Organism:
GUINEA PIG
Description:
Cholinergic, muscarinic 0 GUINEA PIG::P06199
Residue:
466
  
Inhibitor
Name:
BDBM50025027
Synonyms:
CHEMBL3337867
Type:
Small organic molecule
Emp. Form.:
C44H54Br2N4
Mol. Mass.:
798.734
SMILES:
[Br-].[Br-].[H][C@@]12C[C@@]3([H])[C@H](CC)C[N+]1(CC=C)CC[C@@]21c2ccccc2N2\C=C4/[C@]5([H])N(\C=C3/[C@@]12[H])c1ccccc1[C@@]51CC[N+]2(CC=C)C[C@@H](CC)[C@]4([H])C[C@@]12[H]
: