Target
Collagenase 3
Ligand
BDBM11863
Substrate
Meas. Tech.
ChEMBL_1442057 (CHEMBL3373425)
IC50
34±n/a nM
Citation
 Nara, HSato, KNaito, TMototani, HOki, HYamamoto, YKuno, HSantou, TKanzaki, NTerauchi, JUchikawa, OKori, M Thieno[2,3-d]pyrimidine-2-carboxamides bearing a carboxybenzene group at 5-position: highly potent, selective, and orally available MMP-13 inhibitors interacting with the S1¿ binding site. Bioorg Med Chem 22:5487-505 (2014)  
Target
Name:
Collagenase 3
Synonyms:
MMP-13 MMP13_HUMAN Matrix metalloproteinase-13 (MMP-13) | Matrix metalloproteinase-13 (MMP13)
Type:
Enzyme
Mol. Mass.:
53808.06
Organism:
Homo sapiens (Human)
Description:
P45452
Residue:
471
  
Inhibitor
Name:
BDBM11863
Synonyms:
4-({[4-(4-chlorophenoxy)benzene]sulfonyl}methyl)-N-hydroxyoxane-4-carboxamide RS 130830 alpha-tetrahydropyran beta-sulfone 1B
Type:
Small organic molecule
Emp. Form.:
C19H20ClNO6S
Mol. Mass.:
425.883
SMILES:
ONC(=O)C1(CS(=O)(=O)c2ccc(Oc3ccc(Cl)cc3)cc2)CCOCC1
: