Target
Transporter
Ligand
BDBM50025216
Substrate
Meas. Tech.
ChEMBL_1442873 (CHEMBL3377151)
EC50
1123±n/a nM
Citation
 Blough, BELandavazo, APartilla, JSDecker, AMPage, KMBaumann, MHRothman, RB Alpha-ethyltryptamines as dual dopamine-serotonin releasers. Bioorg Med Chem Lett 24:4754-8 (2014)  
Target
Name:
Transporter
Synonyms:
Monoamine transporters; Norepininephrine & dopamine | Norepinephrine Monoamine transporters
Type:
PROTEIN
Mol. Mass.:
66787.87
Organism:
Rattus norvegicus
Description:
ChEMBL_1463061
Residue:
597
  
Inhibitor
Name:
BDBM50025216
Synonyms:
CHEMBL382635
Type:
Small organic molecule
Emp. Form.:
C10H11FN2
Mol. Mass.:
178.2061
SMILES:
NCCc1c[nH]c2cccc(F)c12
: